BDBM344422 US9783500, Compound 17
SMILES CNCc1cc(OCc2ccc3ccc(N)nc3c2)ccc1Cl
InChI Key InChIKey=SVDORCPNIHFYFA-UHFFFAOYSA-N
Data  24 KI
PDB links: 6 PDB IDs match this monomer.
  Tab Delimited (TSV)   2D SDfile   Computed 3D by Vconf -m prep SDfile
Find this compound or compounds like it in BindingDB:
Activity Spreadsheet -- Enzyme Inhibition Constant Data from BindingDB
Found 24 hits for monomerid = 344422
TargetNitric oxide synthase, brain(Rattus norvegicus (rat))
Northwestern University
US Patent
LigandPNGBDBM344422(US9783500, Compound 17)
Affinity DataKi:  32nM. Assay description: Rat and human nNOS, murine macrophage iNOS, and human eNOS were recombinant enzymes (expressed in E. coli and purified as reported previously in the ...
Ligand InfoPC cidPC sidPDB
TargetNitric oxide synthase, brain(Homo sapiens (Human))
Northwestern University
US Patent
LigandPNGBDBM344422(US9783500, Compound 17)
Affinity DataKi:  54nM. Assay description: Rat and human nNOS, murine macrophage iNOS, and human eNOS were recombinant enzymes (expressed in E. coli and purified as reported previously in the ...
Ligand InfoPC cidPC sidPDB
TargetNitric oxide synthase, brain(Rattus norvegicus (rat))
Northwestern University
US Patent
LigandPNGBDBM344422(US9783500, Compound 17)
Affinity DataKi:  58nM. Assay description: Inhibition of rat nNOS expressed in Escherichia coli expression system assessed as reduction in NO production in presence of L-arginine measured for ...
Ligand InfoPC cidPC sidPDB
TargetNitric oxide synthase, brain(Rattus norvegicus (rat))
Northwestern University
US Patent
LigandPNGBDBM344422(US9783500, Compound 17)
Affinity DataKi:  58nM. Assay description: Inhibition of wild type recombinant rat nNOS expressed in Escherichia coli assessed as nitric oxide production by hemoglobin capture assay
Ligand InfoPC cidPC sidPDB
TargetNitric oxide synthase, brain(Rattus norvegicus (rat))
Northwestern University
US Patent
LigandPNGBDBM344422(US9783500, Compound 17)
Affinity DataKi:  58nM. Assay description: Inhibition of recombinant rat nNOS expressed in Escherichia coli assessed as reduction in nitric oxide production using L-arginine as substrate measu...
Ligand InfoPC cidPC sidPDB
TargetNitric oxide synthase, brain(Rattus norvegicus (rat))
Northwestern University
US Patent
LigandPNGBDBM344422(US9783500, Compound 17)
Affinity DataKi:  58nM. Assay description: Inhibition of recombinant rat nNOS expressed in Escherichia coli using L-arginine as substrate after 30 secs by hemoglobin capture assay
Ligand InfoPC cidPC sidPDB
TargetAlpha-2C adrenergic receptor(Homo sapiens (Human))
Northwestern University
Curated by ChEMBL
LigandPNGBDBM344422(US9783500, Compound 17)
Affinity DataKi: <100nM. Assay description: Binding affinity to alpha2C adrenergic receptor (unknown origin)
Ligand InfoPC cidPC sidPDB
In DepthDetails ArticlePubMed
TargetHistamine H2 receptor(Homo sapiens (Human))
Northwestern University
Curated by ChEMBL
LigandPNGBDBM344422(US9783500, Compound 17)
Affinity DataKi: <100nM. Assay description: Binding affinity to histamine H2 receptor (unknown origin)
Ligand InfoPC cidPC sidPDB
In DepthDetails ArticlePubMed
TargetSodium-dependent serotonin transporter(Homo sapiens (Human))
Northwestern University
Curated by ChEMBL
LigandPNGBDBM344422(US9783500, Compound 17)
Affinity DataKi: <100nM. Assay description: Binding affinity to SERT (unknown origin)
Ligand InfoPC cidPC sidPDB
In DepthDetails ArticlePubMed
TargetNitric oxide synthase, brain(Homo sapiens (Human))
Northwestern University
US Patent
LigandPNGBDBM344422(US9783500, Compound 17)
Affinity DataKi:  295nM. Assay description: Inhibition of recombinant human full-length nNOS expressed in Escherichia coli BL21(DE3) assessed as reduction in nitric oxide production using L-arg...
Ligand InfoPC cidPC sidPDB
TargetNitric oxide synthase, brain(Homo sapiens (Human))
Northwestern University
US Patent
LigandPNGBDBM344422(US9783500, Compound 17)
Affinity DataKi:  295nM. Assay description: Inhibition of recombinant human nNOS expressed in Escherichia coli using L-arginine as substrate after 30 secs by hemoglobin capture assay
Ligand InfoPC cidPC sidPDB
TargetNitric oxide synthase, brain(Homo sapiens (Human))
Northwestern University
US Patent
LigandPNGBDBM344422(US9783500, Compound 17)
Affinity DataKi:  295nM. Assay description: Inhibition of human nNOS expressed in Escherichia coli expression system assessed as reduction in NO production in presence of L-arginine measured fo...
Ligand InfoPC cidPC sidPDB
TargetNitric oxide synthase, brain(Homo sapiens (Human))
Northwestern University
US Patent
LigandPNGBDBM344422(US9783500, Compound 17)
Affinity DataKi:  295nM. Assay description: Inhibition of recombinant human nNOS expressed in Escherichia coli assessed as nitric oxide production by hemoglobin capture assay
Ligand InfoPC cidPC sidPDB
TargetNitric oxide synthase, brain(Mus musculus)
Northwestern University
US Patent
LigandPNGBDBM344422(US9783500, Compound 17)
Affinity DataKi:  3.34E+3nM. Assay description: Rat and human nNOS, murine macrophage iNOS, and human eNOS were recombinant enzymes (expressed in E. coli and purified as reported previously in the ...
Ligand InfoPC cidPC sidPDB
TargetNitric oxide synthase, inducible(Homo sapiens (Human))
Northwestern University
US Patent
LigandPNGBDBM344422(US9783500, Compound 17)
Affinity DataKi:  6.08E+3nM. Assay description: Rat and human nNOS, murine macrophage iNOS, and human eNOS were recombinant enzymes (expressed in E. coli and purified as reported previously in the ...
Ligand InfoPC cidPC sidPDB
In DepthDetails US Patent
TargetNitric oxide synthase, endothelial(Homo sapiens (Human))
Northwestern University
Curated by ChEMBL
LigandPNGBDBM344422(US9783500, Compound 17)
Affinity DataKi:  7.41E+3nM. Assay description: Inhibition of human eNOS expressed in Escherichia coli expression system assessed as reduction in NO production in presence of L-arginine measured fo...
Ligand InfoPC cidPC sidPDB
TargetNitric oxide synthase, endothelial(Homo sapiens (Human))
Northwestern University
Curated by ChEMBL
LigandPNGBDBM344422(US9783500, Compound 17)
Affinity DataKi:  7.41E+3nM. Assay description: Inhibition of recombinant human eNOS expressed in Escherichia coli using L-arginine as substrate after 30 secs by hemoglobin capture assay
Ligand InfoPC cidPC sidPDB
TargetNitric oxide synthase, endothelial(Homo sapiens (Human))
Northwestern University
Curated by ChEMBL
LigandPNGBDBM344422(US9783500, Compound 17)
Affinity DataKi:  7.41E+3nM. Assay description: Inhibition of recombinant human full-length eNOS expressed in Escherichia coli BL21(DE3) assessed as reduction in nitric oxide production using L-arg...
Ligand InfoPC cidPC sidPDB
TargetNitric oxide synthase, endothelial(Bos taurus (bovine))
Northwestern University
Curated by ChEMBL
LigandPNGBDBM344422(US9783500, Compound 17)
Affinity DataKi:  1.25E+4nM. Assay description: Inhibition of recombinant bovine eNOS expressed in Escherichia coli assessed as nitric oxide production by hemoglobin capture assay
Ligand InfoPC cidPC sidPDB
TargetNitric oxide synthase, endothelial(Bos taurus (bovine))
Northwestern University
Curated by ChEMBL
LigandPNGBDBM344422(US9783500, Compound 17)
Affinity DataKi:  1.25E+4nM. Assay description: Inhibition of recombinant bovine eNOS expressed in Escherichia coli using L-arginine as substrate after 30 secs by hemoglobin capture assay
Ligand InfoPC cidPC sidPDB
TargetNitric oxide synthase, inducible(Mus musculus (mouse))
Northwestern University
Curated by ChEMBL
LigandPNGBDBM344422(US9783500, Compound 17)
Affinity DataKi:  2.77E+4nM. Assay description: Inhibition of mouse iNOS expressed in Escherichia coli expression system assessed as reduction in NO production in presence of L-arginine measured fo...
Ligand InfoPC cidPC sidPDB
In DepthDetails ArticlePubMed
TargetNitric oxide synthase, inducible(Mus musculus (mouse))
Northwestern University
Curated by ChEMBL
LigandPNGBDBM344422(US9783500, Compound 17)
Affinity DataKi:  2.77E+4nM. Assay description: Inhibition of recombinant mouse macrophage iNOS expressed in Escherichia coli using L-arginine as substrate after 30 secs by hemoglobin capture assay
Ligand InfoPC cidPC sidPDB
In DepthDetails ArticlePubMed
TargetNitric oxide synthase, inducible(Mus musculus (mouse))
Northwestern University
Curated by ChEMBL
LigandPNGBDBM344422(US9783500, Compound 17)
Affinity DataKi:  2.77E+4nM. Assay description: Inhibition of recombinant mouse macrophage iNOS expressed in Escherichia coli assessed as reduction in nitric oxide production using L-arginine as su...
Ligand InfoPC cidPC sidPDB
In DepthDetails ArticlePubMed
TargetNitric oxide synthase, inducible(Mus musculus (mouse))
Northwestern University
Curated by ChEMBL
LigandPNGBDBM344422(US9783500, Compound 17)
Affinity DataKi:  2.77E+4nM. Assay description: Inhibition of recombinant murine iNOS expressed in Escherichia coli assessed as nitric oxide production by hemoglobin capture assay
Ligand InfoPC cidPC sidPDB
In DepthDetails ArticlePubMed