BDBM344425 US9783500, Compound (R)-19
SMILES CN[C@H](C)c1cncc(OCc2ccc3ccc(N)nc3c2)c1
InChI Key InChIKey=PKYCUWKYSZUTFJ-GFCCVEGCSA-N
Data  4 KI
  Tab Delimited (TSV)   2D SDfile   Computed 3D by Vconf -m prep SDfile
Find this compound or compounds like it in BindingDB:
Activity Spreadsheet -- Enzyme Inhibition Constant Data from BindingDB
Found 4 hits for monomerid = 344425
TargetNitric oxide synthase, brain(Rattus norvegicus (rat))
Northwestern University
US Patent
LigandPNGBDBM344425(US9783500, Compound (R)-19)
Affinity DataKi:  61nM. Assay description: Rat and human nNOS, murine macrophage iNOS, and human eNOS were recombinant enzymes (expressed in E. coli and purified as reported previously in the ...
Ligand InfoPC cidPC sid
In DepthDetails US Patent
TargetNitric oxide synthase, brain(Homo sapiens (Human))
Northwestern University
US Patent
LigandPNGBDBM344425(US9783500, Compound (R)-19)
Affinity DataKi:  65nM. Assay description: Rat and human nNOS, murine macrophage iNOS, and human eNOS were recombinant enzymes (expressed in E. coli and purified as reported previously in the ...
Ligand InfoPC cidPC sid
In DepthDetails US Patent
TargetNitric oxide synthase, brain(Mus musculus)
Northwestern University
US Patent
LigandPNGBDBM344425(US9783500, Compound (R)-19)
Affinity DataKi:  7.35E+3nM. Assay description: Rat and human nNOS, murine macrophage iNOS, and human eNOS were recombinant enzymes (expressed in E. coli and purified as reported previously in the ...
Ligand InfoPC cidPC sid
In DepthDetails US Patent
TargetNitric oxide synthase, inducible(Homo sapiens (Human))
Northwestern University
US Patent
LigandPNGBDBM344425(US9783500, Compound (R)-19)
Affinity DataKi:  1.61E+4nM. Assay description: Rat and human nNOS, murine macrophage iNOS, and human eNOS were recombinant enzymes (expressed in E. coli and purified as reported previously in the ...
Ligand InfoPC cidPC sid
In DepthDetails US Patent