BDBM345139 1-(4-((2-((3-(2-(Dimethylamino)ethoxy)phenyl)amino)pyrimidin-4-yl)oxy)naphthalen-1-yl)-3-(1-(p-tolyl)-3-(trimethylsilyl)-1H-pyrazol-5-yl)urea::US9783556, Example 11
SMILES CN(C)CCOc1cccc(Nc2nccc(Oc3ccc(NC(=O)Nc4cc(nn4-c4ccc(C)cc4)[Si](C)(C)C)c4ccccc34)n2)c1
InChI Key InChIKey=TZOSTVSVVOBLKW-UHFFFAOYSA-N
Data  1 IC50
  Tab Delimited (TSV)   2D SDfile   Computed 3D by Vconf -m prep SDfile
Find this compound or compounds like it in BindingDB:
Activity Spreadsheet -- Enzyme Inhibition Constant Data from BindingDB
Found 1 hit for monomerid = 345139
TargetGlycogen synthase kinase-3 alpha(Homo sapiens (Human))
Respivert
US Patent
LigandPNGBDBM345139(1-(4-((2-((3-(2-(Dimethylamino)ethoxy)phenyl)amino...)
Affinity DataIC50:  690nM. Assay description: The inhibitory activities of compounds of the invention against the GSK 3α enzyme isoform (Invitrogen), are evaluated by determining the level o...
Ligand InfoPC cidPC sid
In DepthDetails US Patent