BDBM345914 US10202367, Compound 60
SMILES CC1OC(=NC1CN1CCC(CC1)C(=O)NCCCN1CCC(C)(C)CC1)c1c(C)cccc1Cl
InChI Key InChIKey=OWMIPHZDWGTKCX-UHFFFAOYSA-N
Data  1 EC50
  Tab Delimited (TSV)   2D SDfile   Computed 3D by Vconf -m prep SDfile
Find this compound or compounds like it in BindingDB:
Activity Spreadsheet -- Enzyme Inhibition Constant Data from BindingDB
Found 1 hit for monomerid = 345914
TargetGenome polyprotein(Hepatitis C virus genotype 2a (isolate HC-J6) (HCV...)
The United States of America, As Represented By The Secretary, Department of Health and Human Services
US Patent
LigandPNGBDBM345914(US10202367, Compound 60)
Affinity DataEC50:  220nM. Assay description: This example demonstrates the EC50 and CC50 values against HCV according to the HCVcc-RLuc reporter assay described in Example 5 and the cytotoxicity...
Ligand InfoPC cidPC sid
In DepthDetails US Patent