BDBM346277 US10202377, Compound 46
SMILES Fc1ccc(cc1)-c1cccc2[nH]c(nc12)-c1n[nH]c2cnc(cc12)-c1cncc(NC(=O)C2CCC2)c1
InChI Key InChIKey=OERSZKKSURKBEU-UHFFFAOYSA-N
Data  1 IC50  1 EC50
  Tab Delimited (TSV)   2D SDfile   Computed 3D by Vconf -m prep SDfile
Find this compound or compounds like it in BindingDB:
Activity Spreadsheet -- Enzyme Inhibition Constant Data from BindingDB
Found 2 hits for monomerid = 346277
TargetTGF-beta receptor type-1(Homo sapiens (Human))
Samumed
US Patent
LigandPNGBDBM346277(US10202377, Compound 46)
Affinity DataEC50:  94nM. Assay description: Compound Screening: Each compound was dissolved in DMSO as a 10 mM stock and used to prepare compound source plates. Serial dilution (1:2, 11-point d...
Ligand InfoPC cidPC sid
In DepthDetails US Patent
TargetProto-oncogene Wnt-1(Homo sapiens (human))
Samumed
US Patent
LigandPNGBDBM346277(US10202377, Compound 46)
Affinity DataIC50:  48.9nM. Assay description: The screening assay for Wnt activity is described as follows. Reporter cell lines can be generated by stably transducing cancer cell lines (e.g., col...
Ligand InfoPC cidPC sid
In DepthDetails US Patent