BDBM347290 US10202418, Compound A2
SMILES CC[C@H](C)[C@H](NC(=O)CC[C@H](O)[C@H](Cc1ccccc1)NC(=O)[C@@H](NC(=O)[C@H](CC(C)C)NC(=O)OC(C)(C)C)C(C)C)C(=O)N[C@@H](C(C)C)C(=O)OC
InChI Key InChIKey=NLMQIDMXAWAXKA-BKLUCDBQSA-N
Data  2 IC50
  Tab Delimited (TSV)   2D SDfile   Computed 3D by Vconf -m prep SDfile
Find this compound or compounds like it in BindingDB:
Activity Spreadsheet -- Enzyme Inhibition Constant Data from BindingDB
Found 2 hits for monomerid = 347290
TargetRenin(Homo sapiens (Human))
Merck Patent
US Patent
LigandPNGBDBM347290(US10202418, Compound A2)
Affinity DataIC50:  1.10E+3nM. Assay description: In order to identify modulators of renin activity, a continuous enzymatic test was carried out with a synthetic peptide which carries a fluorescent g...
Ligand InfoPC cidPC sid
In DepthDetails US Patent
TargetCathepsin D(Homo sapiens (Human))
Merck Patent
US Patent
LigandPNGBDBM347290(US10202418, Compound A2)
Affinity DataIC50:  41nM. Assay description: In order to identify modulators of cathepsin D activity, a continuous enzymatic test was carried out with a synthetic peptide which carries a fluores...
Ligand InfoPC cidPC sid
In DepthDetails US Patent