BDBM347291 US10202418, Compound A3
SMILES CC(C)[C@H](NC(=O)Cc1cccc(OC(F)(F)F)c1)C(=O)N[C@@H](Cc1ccccc1)[C@@H](O)CCC(=O)NCCc1ccccc1
InChI Key InChIKey=RZYDFYGCBKMZSB-OLWNVYNHSA-N
Data  1 IC50
  Tab Delimited (TSV)   2D SDfile   Computed 3D by Vconf -m prep SDfile
Find this compound or compounds like it in BindingDB:
Activity Spreadsheet -- Enzyme Inhibition Constant Data from BindingDB
Found 1 hit for monomerid = 347291
TargetRenin(Homo sapiens (Human))
Merck Patent
US Patent
LigandPNGBDBM347291(US10202418, Compound A3)
Affinity DataIC50: >3.00E+4nM. Assay description: In order to identify modulators of renin activity, a continuous enzymatic test was carried out with a synthetic peptide which carries a fluorescent g...
Ligand InfoPC cidPC sid
In DepthDetails US Patent