BDBM347306 US10202418, Compound A19
SMILES CCOc1cccc(CC(=O)N[C@@H](C(C)C)C(=O)N[C@@H](Cc2ccccc2)[C@@H](O)CCC(=O)NCCc2ccccc2)c1
InChI Key InChIKey=XODWFBHLGAJLRT-JHFJJOSTSA-N
Data  1 IC50
  Tab Delimited (TSV)   2D SDfile   Computed 3D by Vconf -m prep SDfile
Find this compound or compounds like it in BindingDB:
Activity Spreadsheet -- Enzyme Inhibition Constant Data from BindingDB
Found 1 hit for monomerid = 347306
TargetRenin(Homo sapiens (Human))
Merck Patent
US Patent
LigandPNGBDBM347306(US10202418, Compound A19)
Affinity DataIC50: >3.00E+4nM. Assay description: In order to identify modulators of renin activity, a continuous enzymatic test was carried out with a synthetic peptide which carries a fluorescent g...
Ligand InfoPC cidPC sid
In DepthDetails US Patent