BDBM348816 US9790235, Number I-67
SMILES COCCOc1nc(Cl)cc(Nc2ccc3c4c5NC[C@@H](C)NC(=O)c5sc4ccc3n2)n1
InChI Key InChIKey=QWGXSSACJAXYHU-LLVKDONJSA-N
Data  1 IC50
  Tab Delimited (TSV)   2D SDfile   Computed 3D by Vconf -m prep SDfile
Find this compound or compounds like it in BindingDB:
Activity Spreadsheet -- Enzyme Inhibition Constant Data from BindingDB
Found 1 hit for monomerid = 348816
TargetMAP kinase-activated protein kinase 2(Homo sapiens (Human))
Celgene Car
US Patent
LigandPNGBDBM348816(US9790235, Number I-67)
Affinity DataIC50: <100nM. Assay description: Compounds I-1 through I-50 of the invention were assayed in a mass spectrometric assay to measure their ability to covalently modify MK2 protein. The...
Ligand InfoPC cidPC sid
In DepthDetails US Patent