BDBM349202 Cyclopropanecarboxylic acid (5-{4-[(3,5-difluoro-pyridin-2- ylamino)-methyl]-phenyl}- [1,2,4]triazolo[1,5-a]pyridin-2- yl)-amide::US10206907, Compound 257
SMILES Fc1cnc(NCc2ccc(cc2)-c2cccc3nc(NC(=O)C4CC4)nn23)c(F)c1
InChI Key InChIKey=BGHHFNFBRHFEOS-UHFFFAOYSA-N
Data  1 IC50
  Tab Delimited (TSV)   2D SDfile   Computed 3D by Vconf -m prep SDfile
Find this compound or compounds like it in BindingDB:
Activity Spreadsheet -- Enzyme Inhibition Constant Data from BindingDB
Found 1 hit for monomerid = 349202
TargetTyrosine-protein kinase JAK2 [808-1132](Homo sapiens (Human))
Galapagos
US Patent
LigandPNGBDBM349202(Cyclopropanecarboxylic acid (5-{4-[(3,5-difluoro-p...)
Affinity DataIC50: <100nM. Assay description: Recombinant human JAK2 catalytic domain (amino acids 808-1132; catalog number PV4210) was purchased from Invitrogen. 0.025 mU of JAK2 was incubated w...
Ligand InfoPC cidPC sid
In DepthDetails US Patent