BDBM349203 Cyclopropanecarboxylic acid (5-{4-[(4-cyano-2-fluoro- phenylamino)-methyl]- phenyl}-[1,2,4]triazolo[1,5- a]pyridin-2-yl)-amide::US10206907, Compound 258
SMILES Fc1cc(ccc1NCc1ccc(cc1)-c1cccc2nc(NC(=O)C3CC3)nn12)C#N
InChI Key InChIKey=VTARVDRGTOIJOL-UHFFFAOYSA-N
Data  1 IC50
  Tab Delimited (TSV)   2D SDfile   Computed 3D by Vconf -m prep SDfile
Find this compound or compounds like it in BindingDB:
Activity Spreadsheet -- Enzyme Inhibition Constant Data from BindingDB
Found 1 hit for monomerid = 349203
TargetTyrosine-protein kinase JAK2 [808-1132](Homo sapiens (Human))
Galapagos
US Patent
LigandPNGBDBM349203(Cyclopropanecarboxylic acid (5-{4-[(4-cyano-2-fluo...)
Affinity DataIC50: <100nM. Assay description: Recombinant human JAK2 catalytic domain (amino acids 808-1132; catalog number PV4210) was purchased from Invitrogen. 0.025 mU of JAK2 was incubated w...
Ligand InfoPC cidPC sid
In DepthDetails US Patent