BDBM350131 US10208044, Compound I-29
SMILES COc1ccc(F)cc1[C@H](Cn1c2ccc(cc2c(=O)n(c1=O)C(C)(C)C(N)=O)-c1ncco1)OC1CCOCC1
InChI Key InChIKey=KDLCGRKHKVMFHR-DEOSSOPVSA-N
Data  1 IC50
  Tab Delimited (TSV)   2D SDfile   Computed 3D by Vconf -m prep SDfile
Find this compound or compounds like it in BindingDB:
Activity Spreadsheet -- Enzyme Inhibition Constant Data from BindingDB
Found 1 hit for monomerid = 350131
TargetAcetyl-CoA carboxylase 2(Homo sapiens (Human))
Gilead Apollo
US Patent
LigandPNGBDBM350131(US10208044, Compound I-29)
Affinity DataIC50:  3.50E+4nM. Assay description: An exemplary procedure for the in vitro ACC inhibition assay, which can be used to determine the inhibitory action of compounds of the invention towa...
Ligand InfoPC cidPC sid
In DepthDetails US Patent