BDBM350285 US10208064, Example 5
SMILES CC1=C(COC1=O)N1CC[C@@]2(CCN(C[C@@H](O)c3ccc-4c(Cn5nnnc-45)c3)C[C@@H]2F)C1=O
InChI Key InChIKey=JRIWLLOBCGOEOS-SELNLUPBSA-N
Data  1 IC50
  Tab Delimited (TSV)   2D SDfile   Computed 3D by Vconf -m prep SDfile
Find this compound or compounds like it in BindingDB:
Activity Spreadsheet -- Enzyme Inhibition Constant Data from BindingDB
Found 1 hit for monomerid = 350285
TargetATP-sensitive inward rectifier potassium channel 1(Homo sapiens (Human))
Wuxi Apptec (Shanghai)
US Patent
LigandPNGBDBM350285(US10208064, Example 5)
Affinity DataIC50:  111nM. Assay description: A Thallium Flux Assay was performed on the compounds of the Examples. This assay has been described previously; see, e.g., PCT Published Application ...
Ligand InfoPC cidPC sid
In DepthDetails US Patent