BDBM350889 3-(2,6-Difluorophenyl)-8-methyl-2-neopentylthio-4-oxo-3,4-dihydroquinazoline ::US9796687, Compound 6
SMILES Cc1cccc2c1nc(SCC(C)(C)C)n(-c1c(F)cccc1F)c2=O
InChI Key InChIKey=SNWVGOLHVCHJGZ-UHFFFAOYSA-N
Data  1 IC50
  Tab Delimited (TSV)   2D SDfile   Computed 3D by Vconf -m prep SDfile
Find this compound or compounds like it in BindingDB:
Activity Spreadsheet -- Enzyme Inhibition Constant Data from BindingDB
Found 1 hit for monomerid = 350889
TargetHigh affinity cAMP-specific 3',5'-cyclic phosphodiesterase 7A(Homo sapiens (Human))
Consejo Superior De Investigaciones Cientificas
US Patent
LigandPNGBDBM350889(3-(2,6-Difluorophenyl)-8-methyl-2-neopentylthio-4-...)
Affinity DataIC50:  8.67E+3nM. Assay description: Measurement of PDE7 inhibition was carried out using a commercial phosphodiesterase activity measurement kit.Some of the compounds of the present inv...
Ligand InfoPC cidPC sid
In DepthDetails US Patent