BDBM350891 3-(2-Methylphenyl)-2-neopentylthio-4-oxo-3,4-dihydroquinazoline::US9796687, Compound 13
SMILES Cc1ccccc1-n1c(SCC(C)(C)C)nc2ccccc2c1=O
InChI Key InChIKey=JMLBYOSLADTQEB-UHFFFAOYSA-N
Data  1 IC50
  Tab Delimited (TSV)   2D SDfile   Computed 3D by Vconf -m prep SDfile
Find this compound or compounds like it in BindingDB:
Activity Spreadsheet -- Enzyme Inhibition Constant Data from BindingDB
Found 1 hit for monomerid = 350891
TargetHigh affinity cAMP-specific 3',5'-cyclic phosphodiesterase 7A(Homo sapiens (Human))
Consejo Superior De Investigaciones Cientificas
US Patent
LigandPNGBDBM350891(3-(2-Methylphenyl)-2-neopentylthio-4-oxo-3,4-dihyd...)
Affinity DataIC50:  1.85E+3nM. Assay description: Measurement of PDE7 inhibition was carried out using a commercial phosphodiesterase activity measurement kit.Some of the compounds of the present inv...
Ligand InfoPC cidPC sid
In DepthDetails US Patent