BDBM350895 2-Ethylthio-3-(2,6-difluorophenyl)-4-oxo-3,4-dihydroquinazoline ::US9796687, Compound 17
SMILES CCSc1nc2ccccc2c(=O)n1-c1c(F)cccc1F
InChI Key InChIKey=WUDHALGNIBASME-UHFFFAOYSA-N
Data  1 IC50
  Tab Delimited (TSV)   2D SDfile   Computed 3D by Vconf -m prep SDfile
Find this compound or compounds like it in BindingDB:
Activity Spreadsheet -- Enzyme Inhibition Constant Data from BindingDB
Found 1 hit for monomerid = 350895
TargetHigh affinity cAMP-specific 3',5'-cyclic phosphodiesterase 7A(Homo sapiens (Human))
Consejo Superior De Investigaciones Cientificas
US Patent
LigandPNGBDBM350895(2-Ethylthio-3-(2,6-difluorophenyl)-4-oxo-3,4-dihyd...)
Affinity DataIC50:  6.99E+3nM. Assay description: Measurement of PDE7 inhibition was carried out using a commercial phosphodiesterase activity measurement kit.Some of the compounds of the present inv...
Ligand InfoPC cidPC sid
In DepthDetails US Patent