BDBM350899 2-Benzylthio-3-phenyl-4-oxo-3,4-dihydroquinazoline ::US9796687, Compound 21
SMILES O=c1n(c(SCc2ccccc2)nc2ccccc12)-c1ccccc1
InChI Key InChIKey=STGAQMVRGXPRKM-UHFFFAOYSA-N
Data  2 IC50
  Tab Delimited (TSV)   2D SDfile   Computed 3D by Vconf -m prep SDfile
Find this compound or compounds like it in BindingDB:
Activity Spreadsheet -- Enzyme Inhibition Constant Data from BindingDB
Found 2 hits for monomerid = 350899
TargetHigh affinity cAMP-specific 3',5'-cyclic phosphodiesterase 7A(Homo sapiens (Human))
Instituto De Qu£Mica M£Dica (Csic)
Curated by ChEMBL
LigandPNGBDBM350899(2-Benzylthio-3-phenyl-4-oxo-3,4-dihydroquinazoline...)
Affinity DataIC50:  600nM. Assay description: Inhibition of human recombinant PDE7A1 using [3H]AMP after 20 mins by scintillation proximity assay
In DepthDetails ArticlePubMed
TargetHigh affinity cAMP-specific 3',5'-cyclic phosphodiesterase 7A(Homo sapiens (Human))
Instituto De Qu£Mica M£Dica (Csic)
Curated by ChEMBL
LigandPNGBDBM350899(2-Benzylthio-3-phenyl-4-oxo-3,4-dihydroquinazoline...)
Affinity DataIC50:  600nM. Assay description: Measurement of PDE7 inhibition was carried out using a commercial phosphodiesterase activity measurement kit.Some of the compounds of the present inv...
In DepthDetails US Patent