BDBM350904 3-Phenyl-2-(4-pyridylmethylthio)-4-oxo-3,4-dihydroquinazoline::US9796687, Compound 27
SMILES O=c1n(c(SCc2ccncc2)nc2ccccc12)-c1ccccc1
InChI Key InChIKey=WVIORRIIXYVEIF-UHFFFAOYSA-N
Data  1 IC50
  Tab Delimited (TSV)   2D SDfile   Computed 3D by Vconf -m prep SDfile
Find this compound or compounds like it in BindingDB:
Activity Spreadsheet -- Enzyme Inhibition Constant Data from BindingDB
Found 1 hit for monomerid = 350904
TargetHigh affinity cAMP-specific 3',5'-cyclic phosphodiesterase 7A(Homo sapiens (Human))
Consejo Superior De Investigaciones Cientificas
US Patent
LigandPNGBDBM350904(3-Phenyl-2-(4-pyridylmethylthio)-4-oxo-3,4-dihydro...)
Affinity DataIC50:  2.60E+3nM. Assay description: Measurement of PDE7 inhibition was carried out using a commercial phosphodiesterase activity measurement kit.Some of the compounds of the present inv...
In DepthDetails US Patent