BDBM351000 US9796700, Compound I-90
SMILES COc1cc(Nc2ncc(c(Nc3ccc(C)cc3NC(=O)C=C)n2)C(F)(F)F)c(C)cn1
InChI Key InChIKey=ILUKRINUNLAVMH-UHFFFAOYSA-N
Data  3 IC50
  Tab Delimited (TSV)   2D SDfile   Computed 3D by Vconf -m prep SDfile
Find this compound or compounds like it in BindingDB:
Activity Spreadsheet -- Enzyme Inhibition Constant Data from BindingDB
Found 3 hits for monomerid = 351000
TargetMitogen-activated protein kinase 3(Homo sapiens (Human))
Celgene Car
US Patent
LigandPNGBDBM351000(US9796700, Compound I-90)
Affinity DataIC50: <100nM. Assay description: The protocol below describes continuous-read kinase assays to measure potency of compounds against activated ERK1 enzyme. The mechanics of the assay ...
In DepthDetails US Patent
TargetMitogen-activated protein kinase 3(Homo sapiens (Human))
Celgene Car
US Patent
LigandPNGBDBM351000(US9796700, Compound I-90)
Affinity DataIC50:  10nM. Assay description: Inhibition of ERK1 (unknown origin)
In DepthDetails PubMed
TargetMitogen-activated protein kinase 1(Homo sapiens (Human))
Southwest Jiaotong University
Curated by ChEMBL
LigandPNGBDBM351000(US9796700, Compound I-90)
Affinity DataIC50:  10nM. Assay description: Inhibition of ERK2 (unknown origin)
In DepthDetails PubMed