BDBM352085 2-(6-((4-((3R,4R,5S)-3-Amino-4-hydroxy-5-methylpiperidin-1-yl)pyridin-3-ylamino)methyl)-3-fluoropyridin-2-yl)-3-fluorobenzonitrile::US9802918, Example 17
SMILES C[C@H]1CN(C[C@@H](N)[C@@H]1O)c1ccncc1NCc1ccc(F)c(n1)-c1c(F)cccc1C#N
InChI Key InChIKey=OHQXWRMHTYKYDV-HGDLERNZSA-N
Data  3 IC50
  Tab Delimited (TSV)   2D SDfile   Computed 3D by Vconf -m prep SDfile
Find this compound or compounds like it in BindingDB:
Activity Spreadsheet -- Enzyme Inhibition Constant Data from BindingDB
Found 3 hits for monomerid = 352085
TargetSerine/threonine-protein kinase pim-1(Homo sapiens (Human))
Incyte
US Patent
LigandPNGBDBM352085(2-(6-((4-((3R,4R,5S)-3-Amino-4-hydroxy-5-methylpip...)
Affinity DataIC50: <10nM. Assay description: Pim-1 and Pim-3 kinase assays-20 μL reactions were run in white 384 well polystyrene plates dotted with 0.8 μL compound/DMSO in the assay b...
Ligand InfoPC cidPC sid
In DepthDetails US Patent
TargetSerine/threonine-protein kinase pim-3(Homo sapiens (Human))
Incyte
US Patent
LigandPNGBDBM352085(2-(6-((4-((3R,4R,5S)-3-Amino-4-hydroxy-5-methylpip...)
Affinity DataIC50: <10nM. Assay description: Pim-1 and Pim-3 kinase assays-20 μL reactions were run in white 384 well polystyrene plates dotted with 0.8 μL compound/DMSO in the assay b...
Ligand InfoPC cidPC sid
In DepthDetails US Patent
TargetSerine/threonine-protein kinase pim-2(Homo sapiens (Human))
Incyte
US Patent
LigandPNGBDBM352085(2-(6-((4-((3R,4R,5S)-3-Amino-4-hydroxy-5-methylpip...)
Affinity DataIC50:  550nM. Assay description: Pim-1 and Pim-3 kinase assays-20 μL reactions were run in white 384 well polystyrene plates dotted with 0.8 μL compound/DMSO in the assay b...
Ligand InfoPC cidPC sid
In DepthDetails US Patent