BDBM352512 (S)-1,1,1-trifluoro-2-methylpropan-2-yl (4-((4-fluorophenyl)sulfonyl)-2-(((N-methylsulfamoyl)amino)methyl)-3,4-dihydro-2H-benzo[b][1,4]oxazin-6-yl)carbamate ::US10745364, Example 12::US9809561, 12
SMILES CNS(=O)(=O)NC[C@H]1CN(c2cc(NC(=O)OC(C)(C)C(F)(F)F)ccc2O1)S(=O)(=O)c1ccc(F)cc1
InChI Key InChIKey=JCVWBVMJFYHNSO-HNNXBMFYSA-N
Data  3 IC50
  Tab Delimited (TSV)   2D SDfile   Computed 3D by Vconf -m prep SDfile
Find this compound or compounds like it in BindingDB:
Activity Spreadsheet -- Enzyme Inhibition Constant Data from BindingDB
Found 3 hits for monomerid = 352512
TargetNuclear receptor ROR-gamma(Homo sapiens (Human))
Merck Sharp & Dohme
US Patent
LigandPNGBDBM352512((S)-1,1,1-trifluoro-2-methylpropan-2-yl (4-((4-flu...)
Affinity DataIC50:  2.72nM. Assay description: The compounds of the invention inhibit RORgammaT activity. Activation of RORgammaT activity can be measured using, e.g., a biochemical TR-FRET assay....
Ligand InfoPC cidPC sid
In DepthDetails US Patent
TargetNuclear receptor ROR-gamma(Homo sapiens (Human))
Merck Sharp & Dohme
US Patent
LigandPNGBDBM352512((S)-1,1,1-trifluoro-2-methylpropan-2-yl (4-((4-flu...)
Affinity DataIC50:  2.72nM. Assay description: To identify novel antagonists of RORgammaT, an assay was developed which employs the interaction of RORgammaT with its co-activator peptide SRC1_2. T...
Ligand InfoPC cidPC sid
In DepthDetails US Patent
TargetNuclear receptor ROR-gamma(Homo sapiens (Human))
Merck Sharp & Dohme
US Patent
LigandPNGBDBM352512((S)-1,1,1-trifluoro-2-methylpropan-2-yl (4-((4-flu...)
Affinity DataIC50:  2.72nM. Assay description: HIS-tagged RORγ-LBD protein was recombinantly expressed in Escherichia coli. The RORγ-LBD protein was purified by Ni2+-affinity resin. Puri...
Ligand InfoPC cidPC sid
In DepthDetails US Patent