BDBM352646 (S)-neopentyl (2-(2- (methylamino)-2- oxoethyl)-4-((3- (trifluoromethyl)phenyl) sulfonyl)-3,4- dihydro-2H- benzo[b][1,4]oxazin-6- yl)carbamate::US10745364, Example 37AH::US9809561, 37AH
SMILES CNC(=O)C[C@H]1CN(c2cc(NC(=O)OCC(C)(C)C)ccc2O1)S(=O)(=O)c1cccc(c1)C(F)(F)F
InChI Key InChIKey=KYTGUTYWMQANRN-KRWDZBQOSA-N
Data  3 IC50
  Tab Delimited (TSV)   2D SDfile   Computed 3D by Vconf -m prep SDfile
Find this compound or compounds like it in BindingDB:
Activity Spreadsheet -- Enzyme Inhibition Constant Data from BindingDB
Found 3 hits for monomerid = 352646
TargetNuclear receptor ROR-gamma(Homo sapiens (Human))
Merck Sharp & Dohme
US Patent
LigandPNGBDBM352646((S)-neopentyl (2-(2- (methylamino)-2- oxoethyl)-4-...)
Affinity DataIC50:  2.11nM. Assay description: The compounds of the invention inhibit RORgammaT activity. Activation of RORgammaT activity can be measured using, e.g., a biochemical TR-FRET assay....
Ligand InfoPC cidPC sid
In DepthDetails US Patent
TargetNuclear receptor ROR-gamma(Homo sapiens (Human))
Merck Sharp & Dohme
US Patent
LigandPNGBDBM352646((S)-neopentyl (2-(2- (methylamino)-2- oxoethyl)-4-...)
Affinity DataIC50:  2.11nM. Assay description: To identify novel antagonists of RORgammaT, an assay was developed which employs the interaction of RORgammaT with its co-activator peptide SRC1_2. T...
Ligand InfoPC cidPC sid
In DepthDetails US Patent
TargetNuclear receptor ROR-gamma(Homo sapiens (Human))
Merck Sharp & Dohme
US Patent
LigandPNGBDBM352646((S)-neopentyl (2-(2- (methylamino)-2- oxoethyl)-4-...)
Affinity DataIC50:  2.11nM. Assay description: HIS-tagged RORγ-LBD protein was recombinantly expressed in Escherichia coli. The RORγ-LBD protein was purified by Ni2+-affinity resin. Puri...
Ligand InfoPC cidPC sid
In DepthDetails US Patent