BDBM35297 benzoylguanidine, 17
SMILES COC(=O)c1ccc(cc1)C(=O)NC(N[C@H]1CCCCN(CC(=O)N2CCCC2)C1=O)=Nc1ccc2oc(C)cc2c1
InChI Key InChIKey=WMBQKZMDBWGVFW-VWLOTQADSA-N
Data  1 IC50
  Tab Delimited (TSV)   2D SDfile   Computed 3D by Vconf -m prep SDfile
Find this compound or compounds like it in BindingDB:
Activity Spreadsheet -- Enzyme Inhibition Constant Data from BindingDB
Found 1 hit for monomerid = 35297
TargetCoagulation factor X(Homo sapiens (Human))
Bristol-Myers Squibb
LigandPNGBDBM35297(benzoylguanidine, 17)
Affinity DataIC50:  6nMpH: 7.4 T: 2°C. Assay description: Time-dependent optical density change was followed at 405 nm using a kinetic microplate reader at room temperature. Enzyme activity in the presence o...
In DepthDetails ArticlePubMed