BDBM35307 heteroaroylguanidine, 27
SMILES Cc1cc2cc(ccc2o1)N=C(N[C@H]1CCCCN(CC(=O)N2CCCC2)C1=O)NC(=O)c1cnn(C)c1
InChI Key InChIKey=NDGAWDDCHYCUAK-QFIPXVFZSA-N
Data  1 IC50
  Tab Delimited (TSV)   2D SDfile   Computed 3D by Vconf -m prep SDfile
Find this compound or compounds like it in BindingDB:
Activity Spreadsheet -- Enzyme Inhibition Constant Data from BindingDB
Found 1 hit for monomerid = 35307
TargetCoagulation factor X(Homo sapiens (Human))
Bristol-Myers Squibb
LigandPNGBDBM35307(heteroaroylguanidine, 27)
Affinity DataIC50:  9nMpH: 7.4 T: 2°C. Assay description: Time-dependent optical density change was followed at 405 nm using a kinetic microplate reader at room temperature. Enzyme activity in the presence o...
In DepthDetails ArticlePubMed