BDBM35398 4-[[6-(4-fluorobenzyl)-5-keto-7H-pyrrolo[3,4-b]pyridin-7-yl]amino]benzoic acid ethyl ester::4-[[6-[(4-fluorophenyl)methyl]-5-oxo-7H-pyrrolo[3,4-b]pyridin-7-yl]amino]benzoic acid ethyl ester::MLS000045782::SMR000028179::cid_3242059::ethyl 4-[[6-[(4-fluorophenyl)methyl]-5-oxidanylidene-7H-pyrrolo[3,4-b]pyridin-7-yl]amino]benzoate::ethyl 4-[[6-[(4-fluorophenyl)methyl]-5-oxo-7H-pyrrolo[3,4-b]pyridin-7-yl]amino]benzoate::ethyl 4-{[6-(4-fluorobenzyl)-5-oxo-6,7-dihydro-5H-pyrrolo[3,4-b]pyridin-7-yl]amino}benzoate
SMILES CCOC(=O)c1ccc(Nc2n(Cc3ccc(F)cc3)c(=O)c3ccc[nH]c23)cc1
InChI Key InChIKey=RTUWTNPZBZBOLW-UHFFFAOYSA-N
Data  2 IC50
  Tab Delimited (TSV)   2D SDfile   Computed 3D by Vconf -m prep SDfile
Find this compound or compounds like it in BindingDB:
Activity Spreadsheet -- Enzyme Inhibition Constant Data from BindingDB
Found 1 hit for monomerid = 35398
TargetDual specificity protein phosphatase 1(Homo sapiens (Human))
University of Pittsburgh
Curated by PubChem BioAssay
LigandPNGBDBM35398(4-[[6-(4-fluorobenzyl)-5-keto-7H-pyrrolo[3,4-b]pyr...)
Affinity DataIC50: >5.00E+4nMpH: 7.0 T: 2°C. Assay description: The MKP-1 HTS confirmation dose response assay has been developed to confirm actives identified in the MH-76391 In vitro HTS assay for MKP-1 inhibito...
Ligand InfoPC cidPC sid
In DepthDetails PCBioAssay