BDBM354865 Preparation of 4-{4-[3-(1H-indol-5-yl)-1H-pyrrolo[2,3-b]pyridin-5-yl]-benzyl}-piperazin-2-one::US10485800, Example 142::US9814704, Example 142
SMILES O=C1CN(Cc2ccc(cc2)-c2cnc3[nH]cc(-c4ccc5[nH]ccc5c4)c3c2)CCN1
InChI Key InChIKey=YDBPOGWNYGAFSX-FCDQGJHFSA-N
Data  2 IC50
  Tab Delimited (TSV)   2D SDfile   Computed 3D by Vconf -m prep SDfile
Find this compound or compounds like it in BindingDB:
Activity Spreadsheet -- Enzyme Inhibition Constant Data from BindingDB
Found 1 hit for monomerid = 354865
TargetMitogen-activated protein kinase kinase kinase 11(Homo sapiens (Human))
The University of Rochester
US Patent
LigandPNGBDBM354865(Preparation of 4-{4-[3-(1H-indol-5-yl)-1H-pyrrolo[...)
Affinity DataIC50: <100nM. Assay description: 200 ng (130 nM) MLK3 (Dundee, DU8313) was incubated with 1 μM inactive MKK7b (Dundee, DU703) in the presence of 2 μM cold ATP (Km) and 0.5 ...
Ligand InfoPC cidPC sid
In DepthDetails US Patent