BDBM356529 N-(Tetrahydrofuran-2-ylmethyl)-2-(4-{1-[3-({[(2,2,2-trifluoroethyl)amino]carbonyl}amino)phenyl]-1H-benzimidazol-5-yl}phenyl)propanamide::US10213427, Example 18::US10813930, Ex. No. 18
SMILES CC(C(=O)NCC1CCCO1)c1ccc(cc1)-c1ccc2n(cnc2c1)-c1cccc(NC(=O)NCC(F)(F)F)c1
InChI Key InChIKey=OSQBJERFYGDDRO-UHFFFAOYSA-N
Data  2 IC50
  Tab Delimited (TSV)   2D SDfile   Computed 3D by Vconf -m prep SDfile
Find this compound or compounds like it in BindingDB:
Activity Spreadsheet -- Enzyme Inhibition Constant Data from BindingDB
Found 1 hit for monomerid = 356529
TargetFibroblast growth factor receptor 3(Homo sapiens (Human))
Incyte
US Patent
LigandPNGBDBM356529(N-(Tetrahydrofuran-2-ylmethyl)-2-(4-{1-[3-({[(2,2,...)
Affinity DataIC50: <10nM. Assay description: The inhibitor potency of compounds of the invention was measured in an enzyme assay that measures peptide phosphorylation using FRET measurements to ...
Ligand InfoPC cidPC sid
In DepthDetails US Patent