BDBM356701 1-(3-(9H-carbazol- 9-yl)-2- hydroxypropyl)-3- cyclobutylimid- azolidin-2-one::US10214507, Compound 96::US10759777, Compound 96
SMILES OC(CN1CCN(C2CCC2)C1=O)Cn1c2ccccc2c2ccccc12
InChI Key InChIKey=ZQNUBBQFABOETC-UHFFFAOYSA-N
Data  2 EC50
  Tab Delimited (TSV)   2D SDfile   Computed 3D by Vconf -m prep SDfile
Find this compound or compounds like it in BindingDB:
Activity Spreadsheet -- Enzyme Inhibition Constant Data from BindingDB
Found 1 hit for monomerid = 356701
TargetPeriod circadian protein homolog 2(Homo sapiens (Human))
Synchronicity Pharma
US Patent
LigandPNGBDBM356701(1-(3-(9H-carbazol- 9-yl)-2- hydroxypropyl)-3- cycl...)
Affinity DataEC50:  493nM. Assay description: In brief, stable U20S reporter cells harboring Per2-dLuc were plated at a density of 30,000 cells/well in Corning 96-well, solid white, flat bottom, ...
Ligand InfoPC cidPC sid
In DepthDetails US Patent