BDBM357652 7-(3- fluorobenzyl)- 3H- [1,2,3]triazolo [4,5-b]pyridin- 5-amine::US10214527, Example 24
SMILES Nc1cc(Cc2cccc(F)c2)c2nn[nH]c2n1
InChI Key InChIKey=JWTBMHZJQHZFOK-UHFFFAOYSA-N
Data  1 IC50
  Tab Delimited (TSV)   2D SDfile   Computed 3D by Vconf -m prep SDfile
Find this compound or compounds like it in BindingDB:
Activity Spreadsheet -- Enzyme Inhibition Constant Data from BindingDB
Found 1 hit for monomerid = 357652
TargetMyeloperoxidase(Homo sapiens (Human))
Bristol-Myers Squibb
US Patent
LigandPNGBDBM357652(7-(3- fluorobenzyl)- 3H- [1,2,3]triazolo [4,5-b]py...)
Affinity DataIC50:  55nM. Assay description: MPO peroxidation activity was measured in 100 mM KPi (pH 7.4) by utilizing the non-fluorescent reagent Amplex Red (Invitrogen catalog # A12222) which...
Ligand InfoPC cidPC sid
In DepthDetails US Patent