BDBM357809 US10214534, Compound 1015
SMILES CCN(c1cc2oc(c(C(=O)NC)c2cc1-c1cccc(c1)C(=O)NC1(C)CC1)-c1ccc(Oc2cccc(F)c2)cc1)S(C)(=O)=O
InChI Key InChIKey=NZUYPLIBTMOOBH-UHFFFAOYSA-N
Data  1 EC50
  Tab Delimited (TSV)   2D SDfile   Computed 3D by Vconf -m prep SDfile
Find this compound or compounds like it in BindingDB:
Activity Spreadsheet -- Enzyme Inhibition Constant Data from BindingDB
Found 1 hit for monomerid = 357809
TargetGenome polyprotein(Hepatitis C Virus (Virus))
Bristol-Myers Squibb
US Patent
LigandPNGBDBM357809(US10214534, Compound 1015)
Affinity DataEC50: >1.00E+3nM. Assay description: To evaluate compound efficacy, titrated compounds were transferred to sterile 384-well tissue culture treated plates, and the plates were seeded with...
Ligand InfoPC cidPC sid
In DepthDetails US Patent