BDBM359806 US9822103, Example 66::rac-(3aS,8bS)—N-((4,6-Dimethyl-2-oxo-1,2-dihydropyridin-3-yl)methyl)-5-(6-methoxypyridin-3-yl)-3a-methyl-2,3,3a,8b-tetrahydro-1H-cyclopenta[b]benzofuran-7-carboxamide
SMILES COc1ccc(cn1)-c1cc(cc2[C@@H]3CCC[C@]3(C)Oc12)C(=O)NCc1c(C)cc(C)[nH]c1=O
InChI Key
Data  1 IC50
  Tab Delimited (TSV)   2D SDfile   Computed 3D by Vconf -m prep SDfile
Find this compound or compounds like it in BindingDB:
Activity Spreadsheet -- Enzyme Inhibition Constant Data from BindingDB
Found 1 hit for monomerid = 359806
TargetHistone-lysine N-methyltransferase EZH2(Homo sapiens (Human))
Bristol-Myers Squibb
US Patent
LigandPNGBDBM359806(US9822103, Example 66 | rac-(3aS,8bS)—N-((4,6-Dime...)
Affinity DataIC50:  750nM. Assay description: EZH2 Histone Methyl Transferase Assay: The effectiveness of compounds of the present invention as inhibitors of histone methyl transferases can be r...
Ligand InfoPC cidPC sid
In DepthDetails US Patent