BDBM360305 (S)-(1-methyl-::US9828339, Example 210
SMILES CN1CCC[C@H]1COC(=O)Nc1ccc(F)cc1-c1cc(F)cc(Cl)c1
InChI Key InChIKey=NVRGKPZUORJFEY-INIZCTEOSA-N
Data  1 KI
  Tab Delimited (TSV)   2D SDfile   Computed 3D by Vconf -m prep SDfile
Find this compound or compounds like it in BindingDB:
Activity Spreadsheet -- Enzyme Inhibition Constant Data from BindingDB
Found 1 hit for monomerid = 360305
TargetMuscarinic acetylcholine receptor M3(Homo sapiens (Human))
Dong-A St
US Patent
LigandPNGBDBM360305((S)-(1-methyl- | US9828339, Example 210)
Affinity DataKi:  4.60nM. Assay description: Cell membrane proteins (Perkin Elmer) wherein human muscarinic M3 receptor was overexpressed, [3H]-methyl scopolamine and test compounds in various c...
Ligand InfoPC cidPC sid
In DepthDetails US Patent