BDBM360387 US9828368, Example 41
SMILES COCCc1ccccc1C(=O)N1C[C@@H](CC[C@H]1C)c1nc(c(C)o1)C(C)(C)O
InChI Key InChIKey=OJMZGVJFHVXDKM-CRAIPNDOSA-N
Data  2 IC50
  Tab Delimited (TSV)   2D SDfile   Computed 3D by Vconf -m prep SDfile
Find this compound or compounds like it in BindingDB:
Activity Spreadsheet -- Enzyme Inhibition Constant Data from BindingDB
Found 2 hits for monomerid = 360387
TargetOrexin/Hypocretin receptor type 1(Rattus norvegicus (Rat))
Merck Sharp & Dohme
US Patent
LigandPNGBDBM360387(US9828368, Example 41)
Affinity DataIC50: >1.00E+4nM
Ligand InfoPC cidPC sid
In DepthDetails US Patent
TargetOrexin receptor type 2(Homo sapiens (Human))
Merck Sharp & Dohme
US Patent
LigandPNGBDBM360387(US9828368, Example 41)
Affinity DataIC50:  57nM. Assay description: For intracellular calcium measurements, Chinese hamster ovary (CHO) cells expressing the rat orexin-1 receptor or the human orexin-2 receptor, are gr...
Ligand InfoPC cidPC sid
In DepthDetails US Patent