BDBM360584 N-((5-(3-methoxyphenyl)isoquinolin- 8-yl)methyl)-2-(4- (trifluoromethyl)phenyl)propanamide::US9828369, Example 141
SMILES COc1cccc(c1)-c1ccc(CNC(=O)C(C)c2ccc(cc2)C(F)(F)F)c2cnccc12
InChI Key InChIKey=MGXDOEPWROTTET-UHFFFAOYSA-N
Data  1 IC50
  Tab Delimited (TSV)   2D SDfile   Computed 3D by Vconf -m prep SDfile
Find this compound or compounds like it in BindingDB:
Activity Spreadsheet -- Enzyme Inhibition Constant Data from BindingDB
Found 1 hit for monomerid = 360584
TargetDiacylglycerol O-acyltransferase 2(Homo sapiens (Human))
Merck Sharpe & Dohme
US Patent
LigandPNGBDBM360584(N-((5-(3-methoxyphenyl)isoquinolin- 8-yl)methyl)-2...)
Affinity DataIC50:  566nM. Assay description: DGAT2 activity was determined by measuring the amount of enzymatic product triolein (1,2,3-Tri(cis-9-octadecenoyl)glycerol) using the membrane prep m...
Ligand InfoPC cidPC sid
In DepthDetails US Patent