BDBM361694 US10221177, Compound 57
SMILES CCC(=O)Cn1c(=O)n(C)c2ncn([C@@H](C)C(=O)Nc3csc(n3)-c3cnc(nc3)N3CC4C(C3)C4(F)F)c2c1=O
InChI Key InChIKey=SUFJYKCRTUPWLF-JQRITLKVSA-N
Data  1 IC50
  Tab Delimited (TSV)   2D SDfile   Computed 3D by Vconf -m prep SDfile
Find this compound or compounds like it in BindingDB:
Activity Spreadsheet -- Enzyme Inhibition Constant Data from BindingDB
Found 1 hit for monomerid = 361694
TargetTransient receptor potential cation channel subfamily A member 1(Homo sapiens (Human))
Hydra Biosciences
US Patent
LigandPNGBDBM361694(US10221177, Compound 57)
Affinity DataIC50:  2nM. Assay description: Compounds of Formula (I) inhibit the TRPA1 channel, as shown by measuring the in vitro inhibition of human TRPA1, provided in data tables shown in Ta...
Ligand InfoPC cidPC sid
In DepthDetails US Patent