BDBM363539 US10640534, Compound 31::US10689414, Compound 31::US10717764, Compound 31::US11021515, Compound 31::US11667673, Compound 31::US9850277, Compound 31
SMILES Fc1cccc(c1)N([C@H](C(=O)NC1CC(F)(F)C1)c1ccccc1Cl)C(=O)[C@@H]1CCC(=O)N1c1ccc(cn1)C(F)(F)F
InChI Key InChIKey=NDUOCLRZDKMNMX-DHLKQENFSA-N
Data  12 IC50
  Tab Delimited (TSV)   2D SDfile   Computed 3D by Vconf -m prep SDfile
Find this compound or compounds like it in BindingDB:
Activity Spreadsheet -- Enzyme Inhibition Constant Data from BindingDB
Found 12 hits for monomerid = 363539
TargetIsocitrate dehydrogenase [NADP] cytoplasmic [R132C](Homo sapiens (Human))
Agios Pharmaceuticals
US Patent
LigandPNGBDBM363539(US10640534, Compound 31 | US10689414, Compound 31 ...)
Affinity DataIC50: <500nM. Assay description: A test compound is prepared as 10 mM stock in DMSO and diluted to 50× final concentration in DMSO, for a 50 μl reaction mixture. IDH enzyme acti...
Ligand InfoPC cidPC sid
In DepthDetails US Patent
TargetIsocitrate dehydrogenase [NADP] cytoplasmic [R132H](Homo sapiens (Human))
Agios Pharmaceuticals
US Patent
LigandPNGBDBM363539(US10640534, Compound 31 | US10689414, Compound 31 ...)
Affinity DataIC50:  1.75E+3nM. Assay description: A test compound is prepared as 10 mM stock in DMSO and diluted to 50× final concentration in DMSO, for a 50 μl reaction mixture. IDH enzyme acti...
Ligand InfoPC cidPC sid
In DepthDetails US Patent
TargetIsocitrate dehydrogenase [NADP] cytoplasmic [R132H](Homo sapiens (Human))
Agios Pharmaceuticals
US Patent
LigandPNGBDBM363539(US10640534, Compound 31 | US10689414, Compound 31 ...)
Affinity DataIC50: <100nM. Assay description: A test compound is prepared as 10 mM stock in DMSO and diluted to 50× final concentration in DMSO, for a 50 μl reaction mixture. IDH enzyme acti...
Ligand InfoPC cidPC sid
In DepthDetails US Patent
TargetIsocitrate dehydrogenase [NADP] cytoplasmic [R132C](Homo sapiens (Human))
Agios Pharmaceuticals
US Patent
LigandPNGBDBM363539(US10640534, Compound 31 | US10689414, Compound 31 ...)
Affinity DataIC50:  300nM. Assay description: A test compound is prepared as 10 mM stock in DMSO and diluted to 50× final concentration in DMSO, for a 50 μl reaction mixture. IDH enzyme acti...
Ligand InfoPC cidPC sid
In DepthDetails US Patent
TargetIsocitrate dehydrogenase [NADP] cytoplasmic [R132H](Homo sapiens (Human))
Agios Pharmaceuticals
US Patent
LigandPNGBDBM363539(US10640534, Compound 31 | US10689414, Compound 31 ...)
Affinity DataIC50: <100nM. Assay description: A test compound is prepared as 10 mM stock in DMSO and diluted to 50× final concentration in DMSO, for a 50 μl reaction mixture. IDH enzyme acti...
Ligand InfoPC cidPC sid
In DepthDetails US Patent
TargetIsocitrate dehydrogenase [NADP] cytoplasmic [R132H](Homo sapiens (Human))
Agios Pharmaceuticals
US Patent
LigandPNGBDBM363539(US10640534, Compound 31 | US10689414, Compound 31 ...)
Affinity DataIC50:  300nM
Ligand InfoPC cidPC sid
In DepthDetails US Patent
TargetIsocitrate dehydrogenase [NADP] cytoplasmic [R132C](Homo sapiens (Human))
Agios Pharmaceuticals
US Patent
LigandPNGBDBM363539(US10640534, Compound 31 | US10689414, Compound 31 ...)
Affinity DataIC50: <100nM. Assay description: A test compound is prepared as 10 mM stock in DMSO and diluted to 50× final concentration in DMSO, for a 50 μl reaction mixture. IDH enzyme acti...
Ligand InfoPC cidPC sid
In DepthDetails US Patent
TargetIsocitrate dehydrogenase [NADP] cytoplasmic [R132H](Homo sapiens (Human))
Agios Pharmaceuticals
US Patent
LigandPNGBDBM363539(US10640534, Compound 31 | US10689414, Compound 31 ...)
Affinity DataIC50:  300nM. Assay description: A test compound is prepared as 10 mM stock in DMSO and diluted to 50× final concentration in DMSO, for a 50 μl reaction mixture. IDH enzyme acti...
Ligand InfoPC cidPC sid
In DepthDetails US Patent
TargetIsocitrate dehydrogenase [NADP] cytoplasmic [R132H](Homo sapiens (Human))
Agios Pharmaceuticals
US Patent
LigandPNGBDBM363539(US10640534, Compound 31 | US10689414, Compound 31 ...)
Affinity DataIC50: <100nM. Assay description: A test compound is prepared as 10 mM stock in DMSO and diluted to 50× final concentration in DMSO, for a 50 μl reaction mixture. IDH enzyme acti...
Ligand InfoPC cidPC sid
In DepthDetails US Patent
TargetIsocitrate dehydrogenase [NADP] cytoplasmic [R132C](Homo sapiens (Human))
Agios Pharmaceuticals
US Patent
LigandPNGBDBM363539(US10640534, Compound 31 | US10689414, Compound 31 ...)
Affinity DataIC50:  300nM
Ligand InfoPC cidPC sid
In DepthDetails US Patent
TargetIsocitrate dehydrogenase [NADP] cytoplasmic [R132C](Homo sapiens (Human))
Agios Pharmaceuticals
US Patent
LigandPNGBDBM363539(US10640534, Compound 31 | US10689414, Compound 31 ...)
Affinity DataIC50: <100nM. Assay description: A test compound is prepared as 10 mM stock in DMSO and diluted to 50× final concentration in DMSO, for a 50 μl reaction mixture. IDH enzyme acti...
Ligand InfoPC cidPC sid
In DepthDetails US Patent
TargetIsocitrate dehydrogenase [NADP] cytoplasmic [R132C](Homo sapiens (Human))
Agios Pharmaceuticals
US Patent
LigandPNGBDBM363539(US10640534, Compound 31 | US10689414, Compound 31 ...)
Affinity DataIC50:  300nM. Assay description: A test compound is prepared as 10 mM stock in DMSO and diluted to 50× final concentration in DMSO, for a 50 μl reaction mixture. IDH enzyme acti...
Ligand InfoPC cidPC sid
In DepthDetails US Patent