BDBM363905 US9856239, 16
SMILES OC(=O)C1(CSc2ccncc2-c2ccc(C#N)c3ccccc23)CCCC1
InChI Key InChIKey=UMWDRGCEPZOZEI-UHFFFAOYSA-N
Data  1 IC50
  Tab Delimited (TSV)   2D SDfile   Computed 3D by Vconf -m prep SDfile
Find this compound or compounds like it in BindingDB:
Activity Spreadsheet -- Enzyme Inhibition Constant Data from BindingDB
Found 1 hit for monomerid = 363905
TargetSolute carrier family 22 member 12(Homo sapiens (Human))
Inventisbio Shanghai
US Patent
LigandPNGBDBM363905(US9856239, 16)
Affinity DataIC50: <100nM. Assay description: Human kidney embryonic cells HEK-293T were grown in a petri dish (diameter=10 cm) containing DMEM and 10% of bovine fetal serum culture solution, and...
Ligand InfoPC cidPC sid
In DepthDetails US Patent