BDBM36412 CID25093486::N-(4-Methylquinolin-8-yl)-4-(endo-4-aza-3,5-dioxotricyclo[5.2.1.02,6]oct-8-en-4-yl)benzamide, 2
SMILES [H][C@]12C[C@]([H])(C=C1)c1c(O)n(c(O)c21)-c1ccc(cc1)C(=O)Nc1cccc2c(C)ccnc12
InChI Key InChIKey=KSLHAODJKMKLGY-CALCHBBNSA-N
Data  1 IC50
  Tab Delimited (TSV)   2D SDfile   Computed 3D by Vconf -m prep SDfile
Find this compound or compounds like it in BindingDB:
Activity Spreadsheet -- Enzyme Inhibition Constant Data from BindingDB
Found 1 hit for monomerid = 36412
TargetProtein Wnt-2(Mus musculus (Mouse))
University of Texas Southwestern Medical Center
LigandPNGBDBM36412(CID25093486 | N-(4-Methylquinolin-8-yl)-4-(endo-4-...)
Affinity DataIC50:  27nMpH: 7.4 T: 2°C. Assay description: Inhibition assay of Wnt response treated with exogenously supplied of Wnt protein ('exogenous Wnt' test)
In DepthDetails ArticlePubMed