BDBM364348 US10570156, Compound 30::US9856274, Compound 30
SMILES CC(Cc1nc2c(C)ncc(C)n2n1)c1nc2c(ccc3ncccc23)n1C
InChI Key InChIKey=HAUUGSWULGALGI-UHFFFAOYSA-N
Data  2 IC50
  Tab Delimited (TSV)   2D SDfile   Computed 3D by Vconf -m prep SDfile
Find this compound or compounds like it in BindingDB:
Activity Spreadsheet -- Enzyme Inhibition Constant Data from BindingDB
Found 2 hits for monomerid = 364348
TargetcAMP and cAMP-inhibited cGMP 3',5'-cyclic phosphodiesterase 10A(Homo sapiens (Human))
Sunovion Pharmaceuticals
US Patent
LigandPNGBDBM364348(US10570156, Compound 30 | US9856274, Compound 30)
Affinity DataIC50:  55nM. Assay description: In one embodiment, the compounds provided herein were assayed for their ability to inhibit human PDE-10A. In one embodiment, the activities of the co...
Ligand InfoPC cidPC sid
In DepthDetails US Patent
TargetcAMP and cAMP-inhibited cGMP 3',5'-cyclic phosphodiesterase 10A(Homo sapiens (Human))
Sunovion Pharmaceuticals
US Patent
LigandPNGBDBM364348(US10570156, Compound 30 | US9856274, Compound 30)
Affinity DataIC50:  55nM. Assay description: In one embodiment, the compounds provided herein were assayed for their ability to inhibit human PDE-10A. In one embodiment, the activities of the co...
Ligand InfoPC cidPC sid
In DepthDetails US Patent