BDBM365079 4-(9-(4-chlorobenzyl)-8,9- dihydro-7H-6-oxa-1,2,2a1- triazabenzo[cd]azulen-4-yl)- N-(1-methyl-1H-pyrazol-5- yl)pyrimidin-2-amine::US10278975, Compound I-36 S::US11376260, Example I-36R::US9867833, Compound I-36(R)
SMILES Cn1nccc1Nc1nccc(n1)-c1cc2OCC[C@@H](Cc3ccc(Cl)cc3)c3nnc(c1)n23
InChI Key InChIKey=RHCIGLIHEMONQQ-INIZCTEOSA-N
Data  3 IC50
  Tab Delimited (TSV)   2D SDfile   Computed 3D by Vconf -m prep SDfile
Find this compound or compounds like it in BindingDB:
Activity Spreadsheet -- Enzyme Inhibition Constant Data from BindingDB
Found 3 hits for monomerid = 365079
TargetMitogen-activated protein kinase 1(Homo sapiens (Human))
Genentech
US Patent
LigandPNGBDBM365079(4-(9-(4-chlorobenzyl)-8,9- dihydro-7H-6-oxa-1,2,2a...)
Affinity DataIC50: <0.0200nM. Assay description: Compounds were tested in an enzymatic assay using human ERK-2 (Mitogen Activated Kinase 1), recombinantly expressed as an n-terminal 6-His fusion pro...
Ligand InfoPC cidPC sid
In DepthDetails US Patent
TargetMitogen-activated protein kinase 6(Homo sapiens (Human))
Genentech
US Patent
LigandPNGBDBM365079(4-(9-(4-chlorobenzyl)-8,9- dihydro-7H-6-oxa-1,2,2a...)
Affinity DataIC50:  0.690nM. Assay description: Compounds were tested in an enzymatic assay using human ERK-2 (Mitogen Activated Kinase 1), recombinantly expressed as an n-terminal 6-His fusion pro...
Ligand InfoPC cidPC sid
In DepthDetails US Patent
TargetMitogen-activated protein kinase 1(Homo sapiens (Human))
Genentech
US Patent
LigandPNGBDBM365079(4-(9-(4-chlorobenzyl)-8,9- dihydro-7H-6-oxa-1,2,2a...)
Affinity DataIC50:  0.690nM. Assay description: Compounds were tested in an enzymatic assay using human ERK-2 (Mitogen Activated Kinase 1), recombinantly expressed as an n-terminal 6-His fusion pro...
Ligand InfoPC cidPC sid
In DepthDetails US Patent