BDBM367226 4-fluoro-2-oxo-N-(4- phenylbutyl)-1,3- benzoxazole-3-carboxamide::US10226452, Example 56
SMILES Fc1cccc2oc(=O)n(C(=O)NCCCCc3ccccc3)c12
InChI Key InChIKey=UYTQXJPWSOZARR-UHFFFAOYSA-N
Data  1 IC50
  Tab Delimited (TSV)   2D SDfile   Computed 3D by Vconf -m prep SDfile
Find this compound or compounds like it in BindingDB:
Activity Spreadsheet -- Enzyme Inhibition Constant Data from BindingDB
Found 1 hit for monomerid = 367226
TargetAcid ceramidase(Homo sapiens (Human))
University of California
US Patent
LigandPNGBDBM367226(4-fluoro-2-oxo-N-(4- phenylbutyl)-1,3- benzoxazole...)
Affinity DataIC50:  1nM. Assay description: The assay was performed in Optiplate 96-wells black plates, with each reaction well containing a mixture of 25 mM sodium acetate buffer pH 4.5 and a ...
Ligand InfoPC cidPC sid
In DepthDetails US Patent