BDBM368524 3-chloro-1-ethyl-N-(1H- pyrazolo[4,3-b]pyridin-3- yl)isoquinolin-6-amine::US10227343, Example 56
SMILES CCc1nc(Cl)cc2cc(Nc3n[nH]c4cccnc34)ccc12
InChI Key InChIKey=PSBWBUVDMBKPIR-UHFFFAOYSA-N
Data  1 EC50
  Tab Delimited (TSV)   2D SDfile   Computed 3D by Vconf -m prep SDfile
Find this compound or compounds like it in BindingDB:
Activity Spreadsheet -- Enzyme Inhibition Constant Data from BindingDB
Found 1 hit for monomerid = 368524
TargetMetabotropic glutamate receptor 4(Homo sapiens (Human))
Vanderbilt University
US Patent
LigandPNGBDBM368524(3-chloro-1-ethyl-N-(1H- pyrazolo[4,3-b]pyridin-3- ...)
Affinity DataEC50:  582nM. Assay description: The disclosed compounds and compositions can be evaluated for their ability to act as a potentiator of metabotropic glutamate receptor activity, in p...
Ligand InfoPC cidPC sid
In DepthDetails US Patent