BDBM369585 US10231967, Example 94-Isomer-1
SMILES CO[C@H]1CC[C@@]2(Cc3ccc(cc3[C@]22N=C(C)C(N)=N2)-c2cc(Br)cc(c2)C#N)CC1
InChI Key InChIKey=BCPJXJSUDZCZSL-NQHRYMMQSA-N
Data  2 IC50
  Tab Delimited (TSV)   2D SDfile   Computed 3D by Vconf -m prep SDfile
Find this compound or compounds like it in BindingDB:
Activity Spreadsheet -- Enzyme Inhibition Constant Data from BindingDB
Found 2 hits for monomerid = 369585
TargetAmyloid-beta precursor protein(Homo sapiens (Human))
Astrazeneca
US Patent
LigandPNGBDBM369585(US10231967, Example 94-Isomer-1)
Affinity DataIC50:  0.170nM. Assay description: SH-SY5Y cells were cultured in DMEM/F-12 with Glutamax, 10% FCS and 1% non-essential amino acids and cryopreserved and stored at −140° C. at a ...
Ligand InfoPC cidPC sid
In DepthDetails US Patent
TargetAmyloid-beta precursor protein(Homo sapiens (Human))
Astrazeneca
US Patent
LigandPNGBDBM369585(US10231967, Example 94-Isomer-1)
Affinity DataIC50:  0.700nM. Assay description: The β-secretase enzyme used in the TR-FRET is prepared as follows: The cDNA for the soluble part of the human β-Secretase (AA 1-AA 460) was...
Ligand InfoPC cidPC sid
In DepthDetails US Patent