BDBM371289 1-[(2,4-Dimethylthiazol-5-yl)methyl]-7-fluoro-N-(1-methylcyclopropyl)-3-[(1-methylpyrazol-4-yl)methyl]-2,4-dioxo-quinazoline-6-sulfonamide::US10239843, Example 396
SMILES Cc1nc(C)c(Cn2c3cc(F)c(cc3c(=O)n(Cc3cnn(C)c3)c2=O)S(=O)(=O)NC2(C)CC2)o1
InChI Key InChIKey=OEHBZLPXZZBGNV-UHFFFAOYSA-N
Data  1 IC50
  Tab Delimited (TSV)   2D SDfile   Computed 3D by Vconf -m prep SDfile
Find this compound or compounds like it in BindingDB:
Activity Spreadsheet -- Enzyme Inhibition Constant Data from BindingDB
Found 1 hit for monomerid = 371289
TargetPoly(ADP-ribose) glycohydrolase(Homo sapiens (Human))
Cancer Research Technology
US Patent
LigandPNGBDBM371289(1-[(2,4-Dimethylthiazol-5-yl)methyl]-7-fluoro-N-(1...)
Affinity DataIC50:  11nM. Assay description: PARG In vitro assays were conducted in a total volume of 15 ul in a standard 384 well format. 5 ul of Human Full Length PARG (Produced internally by ...
Ligand InfoPC cidPC sid
In DepthDetails US Patent