BDBM371330 1-[(2,5-Dimethylpyrazol-3-yl)methyl]-N-[1-(fluoromethyl)cyclopropyl]-3-[(1-methylpyrazol-4-yl)methyl]-2,4-dioxo-quinazoline-6-sulfonamide::US10239843, Example 437
SMILES Cc1cc(Cn2c3ccc(cc3c(=O)n(Cc3cnn(C)c3)c2=O)S(=O)(=O)NC2(CF)CC2)n(C)n1
InChI Key InChIKey=JVLFHZNOVBNDFR-UHFFFAOYSA-N
Data  1 IC50
  Tab Delimited (TSV)   2D SDfile   Computed 3D by Vconf -m prep SDfile
Find this compound or compounds like it in BindingDB:
Activity Spreadsheet -- Enzyme Inhibition Constant Data from BindingDB
Found 1 hit for monomerid = 371330
TargetPoly(ADP-ribose) glycohydrolase(Homo sapiens (Human))
Cancer Research Technology
US Patent
LigandPNGBDBM371330(1-[(2,5-Dimethylpyrazol-3-yl)methyl]-N-[1-(fluorom...)
Affinity DataIC50:  23nM. Assay description: PARG In vitro assays were conducted in a total volume of 15 ul in a standard 384 well format. 5 ul of Human Full Length PARG (Produced internally by ...
Ligand InfoPC cidPC sid
In DepthDetails US Patent