BDBM371572 4-chloro-2-methyl-5-((1-((1-methyl-1H-imidazol-2-yl)methyl)piperidin-3-yl)amino)pyridazin-3(2H)-one::US10239861, Example 52
SMILES Cn1ccnc1CN1CCCC(C1)Nc1cnn(C)c(=O)c1Cl
InChI Key InChIKey=GRUAQNRPAASLLH-UHFFFAOYSA-N
Data  1 IC50
  Tab Delimited (TSV)   2D SDfile   Computed 3D by Vconf -m prep SDfile
Find this compound or compounds like it in BindingDB:
Activity Spreadsheet -- Enzyme Inhibition Constant Data from BindingDB
Found 1 hit for monomerid = 371572
TargetHistone acetyltransferase KAT2B(Homo sapiens (Human))
Genetech
US Patent
LigandPNGBDBM371572(4-chloro-2-methyl-5-((1-((1-methyl-1H-imidazol-2-y...)
Affinity DataIC50:  1.41E+3nM. Assay description: His/Flag epitope tagged PCAF719-832 bromodomain was cloned, expressed and purified to homogeneity in-house. PCAF bromodomain binding and inhibition o...
Ligand InfoPC cidPC sid
In DepthDetails US Patent