BDBM371858 US10239870, Example 59::US10239870, Example 60
SMILES Cc1ncoc1-c1nnc(SCCCN2CC[C@]3(CC3c3cc(Cl)cc(Cl)c3)C2)n1C
InChI Key InChIKey=FCYQRIODPYABJL-YSYXNDDBSA-N
Data  4 KI
  Tab Delimited (TSV)   2D SDfile   Computed 3D by Vconf -m prep SDfile
Find this compound or compounds like it in BindingDB:
Activity Spreadsheet -- Enzyme Inhibition Constant Data from BindingDB
Found 4 hits for monomerid = 371858
TargetD(3) dopamine receptor(Rattus norvegicus (Rat))
Indivior
US Patent
LigandPNGBDBM371858(US10239870, Example 59 | US10239870, Example 60)
Affinity DataKi:  0.417nM. Assay description: [125I]-7OH-PIPAT Binding Assay at rat native D3 receptor on membranes from rat ventral striatum. Homogenates from frozen rat brain ventral striatum (...
Ligand InfoPC cidPC sid
In DepthDetails US Patent
TargetD(3) dopamine receptor(Rattus norvegicus (Rat))
Indivior
US Patent
LigandPNGBDBM371858(US10239870, Example 59 | US10239870, Example 60)
Affinity DataKi:  0.977nM. Assay description: [125I]-7OH-PIPAT Binding Assay at rat native D3 receptor on membranes from rat ventral striatum. Homogenates from frozen rat brain ventral striatum (...
Ligand InfoPC cidPC sid
In DepthDetails US Patent
TargetD(2) dopamine receptor(Homo sapiens (Human))
Indivior
US Patent
LigandPNGBDBM371858(US10239870, Example 59 | US10239870, Example 60)
Affinity DataKi:  61.7nM. Assay description: CHO cells stably expressing human dopamine receptor type 2, long variant (hD2L), coupled to Gα16 protein (CHO-Gα16-hD2L) were re-suspended ...
Ligand InfoPC cidPC sid
In DepthDetails US Patent
TargetD(2) dopamine receptor(Homo sapiens (Human))
Indivior
US Patent
LigandPNGBDBM371858(US10239870, Example 59 | US10239870, Example 60)
Affinity DataKi:  66.1nM. Assay description: CHO cells stably expressing human dopamine receptor type 2, long variant (hD2L), coupled to Gα16 protein (CHO-Gα16-hD2L) were re-suspended ...
Ligand InfoPC cidPC sid
In DepthDetails US Patent