BDBM37413 7-methoxy-N-(3-pyridinylmethyl)-4,5-dihydrobenzo[g][1,2]benzoxazole-3-carboxamide::7-methoxy-N-(3-pyridylmethyl)-4,5-dihydrobenz[g]indoxazene-3-carboxamide::7-methoxy-N-(pyridin-3-ylmethyl)-4,5-dihydrobenzo[g][1,2]benzoxazole-3-carboxamide::7-methoxy-N-(pyridin-3-ylmethyl)-4,5-dihydronaphtho[2,1-d]isoxazole-3-carboxamide::MLS000087435::SMR000023658::cid_3241578
SMILES COc1ccc2-c3onc(C(=O)NCc4cccnc4)c3CCc2c1
InChI Key InChIKey=IDPPIZVOMYKNMR-UHFFFAOYSA-N
Data  3 IC50
  Tab Delimited (TSV)   2D SDfile   Computed 3D by Vconf -m prep SDfile
Find this compound or compounds like it in BindingDB:
Activity Spreadsheet -- Enzyme Inhibition Constant Data from BindingDB
Found 3 hits for monomerid = 37413
TargetSphingosine 1-phosphate receptor 3(Homo sapiens (Human))
The Scripps Research Institute Molecular Screening Center
Curated by PubChem BioAssay
LigandPNGBDBM37413(7-methoxy-N-(3-pyridinylmethyl)-4,5-dihydrobenzo[g...)
Affinity DataIC50: >4.98E+4nM. Assay description: Source (MLSCN Center Name): The Scripps Research Institute Molecular Screening Center Center Affiliation: The Scripps Research Institute, TSRI Assay ...
In DepthDetails PCBioAssay
TargetCathepsin G(Homo sapiens (Human))
Pcmd
Curated by PubChem BioAssay
LigandPNGBDBM37413(7-methoxy-N-(3-pyridinylmethyl)-4,5-dihydrobenzo[g...)
Affinity DataIC50:  1.39E+3nM. Assay description: Screening Center: Penn Center for Molecular Discovery Center Affiliation: University of Pennsylvania Network: Molecular Library Screening Center Netw...
In DepthDetails PCBioAssay
TargetCoagulation factor XII(Homo sapiens (Human))
Pcmd
Curated by PubChem BioAssay
LigandPNGBDBM37413(7-methoxy-N-(3-pyridinylmethyl)-4,5-dihydrobenzo[g...)
Affinity DataIC50:  3.76E+3nM. Assay description: Molecular Library Screening Center Network (MLSCN) Penn Center for Molecular Discovery (PCMD) Assay Provider: Scott L. Diamond, University of Pennsy...
In DepthDetails PCBioAssay