BDBM374258 (S)-(4-(6-(6-(1-aminobutyl)pyridin-2-yl)-1H-indazol-1-yl)pyrimidin-2-yl)methanol::US10246456, Example 401::US10577367, Example 401
SMILES CCC[C@H](N)c1cccc(n1)-c1ccc2cnn(-c3ccnc(CO)n3)c2c1
InChI Key InChIKey=OTIGXKRZOFWHKE-INIZCTEOSA-N
Data  2 IC50
  Tab Delimited (TSV)   2D SDfile   Computed 3D by Vconf -m prep SDfile
Find this compound or compounds like it in BindingDB:
Activity Spreadsheet -- Enzyme Inhibition Constant Data from BindingDB
Found 1 hit for monomerid = 374258
TargetInterleukin-1 receptor-associated kinase 4(Homo sapiens (Human))
Biogen Ma
US Patent
LigandPNGBDBM374258((S)-(4-(6-(6-(1-aminobutyl)pyridin-2-yl)-1H-indazo...)
Affinity DataIC50: <100nM. Assay description: The biochemical assay is in a AlphaScreen format. The kinase reaction is based on the IRAK-4 phosphorylation of a biotin labeled peptide. The phospho...
Ligand InfoPC cidPC sid
In DepthDetails US Patent