BDBM375564 4-(6-(4-(1-methyl-1,9-diazaspiro[5.5]undecane-9-carbonyl)phenyl)imidazo[1,2-a]pyridin-3-yl)benzonitrile::US9908886, Example 119
SMILES CN1CCCCC11CCN(CC1)C(=O)c1ccc(cc1)-c1ccc2ncc(-c3ccc(cc3)C#N)n2c1
InChI Key InChIKey=GOZBCHJGPVCWID-UHFFFAOYSA-N
Data  2 IC50
  Tab Delimited (TSV)   2D SDfile   Computed 3D by Vconf -m prep SDfile
Find this compound or compounds like it in BindingDB:
Activity Spreadsheet -- Enzyme Inhibition Constant Data from BindingDB
Found 2 hits for monomerid = 375564
TargetMAP kinase-interacting serine/threonine-protein kinase 2(Homo sapiens (Human))
Agency For Science, Technology and Research
US Patent
LigandPNGBDBM375564(4-(6-(4-(1-methyl-1,9-diazaspiro[5.5]undecane-9-ca...)
Affinity DataIC50: <100nM. Assay description: MNK1 and MNK2 inhibitor activity was determined using recombinant kinase domains expressed in E. coli. MNK1 and MNK2 were expressed as GST fusion pro...
Ligand InfoPC cidPC sid
In DepthDetails US Patent
TargetMAP kinase-interacting serine/threonine-protein kinase 1(Homo sapiens (Human))
Agency For Science, Technology and Research
US Patent
LigandPNGBDBM375564(4-(6-(4-(1-methyl-1,9-diazaspiro[5.5]undecane-9-ca...)
Affinity DataIC50: <100nM. Assay description: MNK1 and MNK2 inhibitor activity was determined using recombinant kinase domains expressed in E. coli. MNK1 and MNK2 were expressed as GST fusion pro...
Ligand InfoPC cidPC sid
In DepthDetails US Patent